Boost failed updating 58 targets

Posted by / 31-Jul-2016 06:07

Boost failed updating 58 targets

Then I had unpacked and tried to install according to user manual. You should be able to do something like: sudo apt-get install libboost-dev .install them.I have followed the steps as below: $tar -zxvf boost_1_54_0gz $cd boost_1_54_0/ $./$./b2 install --prefix=PREFIX But I got an error message..... For tophat there are also pre-compiled binaries distributed from the project site which might well be easier to install since you won't need to install all of the source dependencies, just the runtime libraries which are probably on your system already.As such the minimum requirement to upgrade to Boost 1.58 is GCC 4.4.7.Using that same logic on the older releases page, 4.1.2 is only listed as a minimum in Boost 1.53, meaning you need to upgrade GCC to at least 4.4.7, attempting to use your repositories then upgrade boost. gcc.compile.c bin.v2/libs/chrono/build/gcc-4.6.2/release/address-model-32/link-static/threading-multi/chrono.o gcc.compile.c bin.v2/libs/chrono/build/gcc-4.6.2/release/address-model-32/link-static/threading-multi/thread_clock.o gcc.compile.c bin.v2/libs/chrono/build/gcc-4.6.2/release/address-model-32/link-static/threading-multi/process_cpu_clocks.o In file included from ./boost/chrono/detail/inlined/process_cpu_clocks.hpp:39:0, from libs/chrono/src/process_cpu_clocks.cpp:17: ./boost/chrono/detail/inlined/posix/process_cpu_clocks.hpp: In static member function ‘static boost::chrono::process_system_cpu_clock::time_point boost::chrono::process_system_cpu_clock::now()’: ./boost/chrono/detail/inlined/posix/process_cpu_clocks.hpp:218:1: warning: control reaches end of non-void function [-Wreturn-type] gcc.archive bin.v2/libs/chrono/build/gcc-4.6.2/release/address-model-32/link-static/threading-multi/libboost_chrono.a stage/lib/libboost_chrono.a common.mkdir bin.v2/libs/date_time/build/gcc-4.6.2/release/address-model-32/link-static common.mkdir bin.v2/libs/date_time/build/gcc-4.6.2/release/address-model-32/link-static/threading-multi common.mkdir bin.v2/libs/date_time/build/gcc-4.6.2/release/address-model-32/link-static/threading-multi/gregorian gcc.compile.c bin.v2/libs/date_time/build/gcc-4.6.2/release/address-model-32/link-static/threading-multi/gregorian/greg_month.o gcc.compile.c bin.v2/libs/date_time/build/gcc-4.6.2/release/address-model-32/link-static/threading-multi/gregorian/greg_weekday.o gcc.compile.c bin.v2/libs/date_time/build/gcc-4.6.2/release/address-model-32/link-static/threading-multi/gregorian/date_generators.o gcc.archive bin.v2/libs/date_time/build/gcc-4.6.2/release/address-model-32/link-static/threading-multi/libboost_date_time.a stage/lib/libboost_date_time.a common.mkdir bin.v2/libs/filesystem/build/gcc-4.6.2/release/address-model-32/link-static common.mkdir bin.v2/libs/filesystem/build/gcc-4.6.2/release/address-model-32/link-static/threading-multi common.mkdir bin.v2/libs/filesystem/build/gcc-4.6.2/release/address-model-32/link-static/threading-multi/v2 common.mkdir bin.v2/libs/filesystem/build/gcc-4.6.2/release/address-model-32/link-static/threading-multi/v2/src gcc.compile.c bin.v2/libs/filesystem/build/gcc-4.6.2/release/address-model-32/link-static/threading-multi/v2/src/v2_operations.o gcc.compile.c bin.v2/libs/filesystem/build/gcc-4.6.2/release/address-model-32/link-static/threading-multi/v2/src/v2_path.o gcc.compile.c bin.v2/libs/filesystem/build/gcc-4.6.2/release/address-model-32/link-static/threading-multi/v2/src/v2_portability.o common.mkdir bin.v2/libs/filesystem/build/gcc-4.6.2/release/address-model-32/link-static/threading-multi/v3 common.mkdir bin.v2/libs/filesystem/build/gcc-4.6.2/release/address-model-32/link-static/threading-multi/v3/src gcc.compile.c bin.v2/libs/filesystem/build/gcc-4.6.2/release/address-model-32/link-static/threading-multi/v3/src/operations.o gcc.compile.c bin.v2/libs/filesystem/build/gcc-4.6.2/release/address-model-32/link-static/threading-multi/v3/src/path.o gcc.compile.c bin.v2/libs/filesystem/build/gcc-4.6.2/release/address-model-32/link-static/threading-multi/v3/src/portability.o gcc.compile.c bin.v2/libs/filesystem/build/gcc-4.6.2/release/address-model-32/link-static/threading-multi/v3/src/windows_file_codecvt.o gcc.compile.c bin.v2/libs/filesystem/build/gcc-4.6.2/release/address-model-32/link-static/threading-multi/v3/src/codecvt_error_category.o gcc.compile.c bin.v2/libs/filesystem/build/gcc-4.6.2/release/address-model-32/link-static/threading-multi/v3/src/path_traits.o gcc.compile.c bin.v2/libs/filesystem/build/gcc-4.6.2/release/address-model-32/link-static/threading-multi/v3/src/unique_path.o gcc.compile.c bin.v2/libs/filesystem/build/gcc-4.6.2/release/address-model-32/link-static/threading-multi/v3/src/utf8_codecvt_facet.o gcc.archive bin.v2/libs/filesystem/build/gcc-4.6.2/release/address-model-32/link-static/threading-multi/libboost_filesystem.a stage/lib/libboost_filesystem.a common.mkdir bin.v2/libs/regex/build/gcc-4.6.2/release/address-model-32/link-static common.mkdir bin.v2/libs/regex/build/gcc-4.6.2/release/address-model-32/link-static/threading-multi gcc.compile.c bin.v2/libs/regex/build/gcc-4.6.2/release/address-model-32/link-static/threading-multi/c_regex_traits.o gcc.compile.c bin.v2/libs/regex/build/gcc-4.6.2/release/address-model-32/link-static/threading-multi/cpp_regex_traits.o gcc.compile.c bin.v2/libs/regex/build/gcc-4.6.2/release/address-model-32/link-static/threading-multi/cregex.o gcc.compile.c bin.v2/libs/regex/build/gcc-4.6.2/release/address-model-32/link-static/threading-multi/fileiter.o gcc.compile.c bin.v2/libs/regex/build/gcc-4.6.2/release/address-model-32/link-static/threading-multi/icu.o gcc.compile.c bin.v2/libs/regex/build/gcc-4.6.2/release/address-model-32/link-static/threading-multi/instances.o gcc.compile.c bin.v2/libs/regex/build/gcc-4.6.2/release/address-model-32/link-static/threading-multi/posix_api.o gcc.compile.c bin.v2/libs/regex/build/gcc-4.6.2/release/address-model-32/link-static/threading-multi/regex.o gcc.compile.c bin.v2/libs/regex/build/gcc-4.6.2/release/address-model-32/link-static/threading-multi/regex_debug.o gcc.compile.c bin.v2/libs/regex/build/gcc-4.6.2/release/address-model-32/link-static/threading-multi/regex_raw_buffer.o gcc.compile.c bin.v2/libs/regex/build/gcc-4.6.2/release/address-model-32/link-static/threading-multi/regex_traits_defaults.o gcc.compile.c bin.v2/libs/regex/build/gcc-4.6.2/release/address-model-32/link-static/threading-multi/static_mutex.o gcc.compile.c bin.v2/libs/regex/build/gcc-4.6.2/release/address-model-32/link-static/threading-multi/w32_regex_traits.o gcc.compile.c bin.v2/libs/regex/build/gcc-4.6.2/release/address-model-32/link-static/threading-multi/wc_regex_traits.o gcc.compile.c bin.v2/libs/regex/build/gcc-4.6.2/release/address-model-32/link-static/threading-multi/wide_posix_api.o gcc.compile.c bin.v2/libs/regex/build/gcc-4.6.2/release/address-model-32/link-static/threading-multi/winstances.o gcc.compile.c bin.v2/libs/regex/build/gcc-4.6.2/release/address-model-32/link-static/threading-multi/usinstances.o gcc.archive bin.v2/libs/regex/build/gcc-4.6.2/release/address-model-32/link-static/threading-multi/libboost_regex.a stage/lib/libboost_regex.a common.mkdir bin.v2/libs/graph/build/gcc-4.6.2/release/address-model-32/link-static common.mkdir bin.v2/libs/graph/build/gcc-4.6.2/release/address-model-32/link-static/threading-multi gcc.compile.c bin.v2/libs/graph/build/gcc-4.6.2/release/address-model-32/link-static/threading-multi/read_graphviz_new.o gcc.compile.c bin.v2/libs/graph/build/gcc-4.6.2/release/address-model-32/link-static/threading-multi/graphml.o gcc.archive bin.v2/libs/graph/build/gcc-4.6.2/release/address-model-32/link-static/threading-multi/libboost_graph.a stage/lib/libboost_graph.a common.mkdir bin.v2/libs/iostreams/build/gcc-4.6.2/release/address-model-32/link-static common.mkdir bin.v2/libs/iostreams/build/gcc-4.6.2/release/address-model-32/link-static/threading-multi gcc.compile.c bin.v2/libs/iostreams/build/gcc-4.6.2/release/address-model-32/link-static/threading-multi/file_descriptor.o gcc.compile.c bin.v2/libs/iostreams/build/gcc-4.6.2/release/address-model-32/link-static/threading-multi/mapped_file.o gcc.compile.c bin.v2/libs/iostreams/build/gcc-4.6.2/release/address-model-32/link-static/threading-multi/zlib.o gcc.compile.c bin.v2/libs/iostreams/build/gcc-4.6.2/release/address-model-32/link-static/threading-multi/gzip.o gcc.compile.c bin.v2/libs/iostreams/build/gcc-4.6.2/release/address-model-32/link-static/threading-multi/bzip2.o gcc.archive bin.v2/libs/iostreams/build/gcc-4.6.2/release/address-model-32/link-static/threading-multi/libboost_iostreams.a stage/lib/libboost_iostreams.a common.mkdir bin.v2/libs/locale/build/gcc-4.6.2/release/address-model-32/link-static common.mkdir bin.v2/libs/locale/build/gcc-4.6.2/release/address-model-32/link-static/threading-multi common.mkdir bin.v2/libs/locale/build/gcc-4.6.2/release/address-model-32/link-static/threading-multi/encoding gcc.compile.c bin.v2/libs/locale/build/gcc-4.6.2/release/address-model-32/link-static/threading-multi/encoding/codepage.o common.mkdir bin.v2/libs/locale/build/gcc-4.6.2/release/address-model-32/link-static/threading-multi/shared gcc.compile.c bin.v2/libs/locale/build/gcc-4.6.2/release/address-model-32/link-static/threading-multi/shared/date_time.o gcc.compile.c bin.v2/libs/locale/build/gcc-4.6.2/release/address-model-32/link-static/threading-multi/shared/format.o gcc.compile.c bin.v2/libs/locale/build/gcc-4.6.2/release/address-model-32/link-static/threading-multi/shared/formatting.o gcc.compile.c bin.v2/libs/locale/build/gcc-4.6.2/release/address-model-32/link-static/threading-multi/shared/generator.o gcc.compile.c bin.v2/libs/locale/build/gcc-4.6.2/release/address-model-32/link-static/threading-multi/shared/ids.o gcc.compile.c bin.v2/libs/locale/build/gcc-4.6.2/release/address-model-32/link-static/threading-multi/shared/localization_backend.o gcc.compile.c bin.v2/libs/locale/build/gcc-4.6.2/release/address-model-32/link-static/threading-multi/shared/message.o gcc.compile.c bin.v2/libs/locale/build/gcc-4.6.2/release/address-model-32/link-static/threading-multi/shared/mo_lambda.o common.mkdir bin.v2/libs/locale/build/gcc-4.6.2/release/address-model-32/link-static/threading-multi/util gcc.compile.c bin.v2/libs/locale/build/gcc-4.6.2/release/address-model-32/link-static/threading-multi/util/codecvt_converter.o gcc.compile.c bin.v2/libs/locale/build/gcc-4.6.2/release/address-model-32/link-static/threading-multi/util/default_locale.o gcc.compile.c bin.v2/libs/locale/build/gcc-4.6.2/release/address-model-32/link-static/threading-multi/util/info.o gcc.compile.c bin.v2/libs/locale/build/gcc-4.6.2/release/address-model-32/link-static/threading-multi/util/locale_data.o common.mkdir bin.v2/libs/locale/build/gcc-4.6.2/release/address-model-32/link-static/threading-multi/posix gcc.compile.c bin.v2/libs/locale/build/gcc-4.6.2/release/address-model-32/link-static/threading-multi/posix/codecvt.o gcc.compile.c bin.v2/libs/locale/build/gcc-4.6.2/release/address-model-32/link-static/threading-multi/posix/collate.o gcc.compile.c bin.v2/libs/locale/build/gcc-4.6.2/release/address-model-32/link-static/threading-multi/posix/converter.o gcc.compile.c bin.v2/libs/locale/build/gcc-4.6.2/release/address-model-32/link-static/threading-multi/posix/numeric.o gcc.compile.c bin.v2/libs/locale/build/gcc-4.6.2/release/address-model-32/link-static/threading-multi/posix/posix_backend.o common.mkdir bin.v2/libs/locale/build/gcc-4.6.2/release/address-model-32/link-static/threading-multi/std gcc.compile.c bin.v2/libs/locale/build/gcc-4.6.2/release/address-model-32/link-static/threading-multi/std/codecvt.o ..600th target... 301 Moved Permanently Location: [following] --2012-01-05 -- Reusing existing connection to downloads.sourceforge.net:80. 302 Found Location: [following] --2012-01-05 -- Resolving .. common.mkdir bin.v2/libs/timer/build/gcc-4.6.2/release common.mkdir bin.v2/libs/timer/build/gcc-4.6.2/release/address-model-32 common.mkdir bin.v2/libs/timer/build/gcc-4.6.2/release/address-model-32/threading-multi gcc.compile.c bin.v2/libs/timer/build/gcc-4.6.2/release/address-model-32/threading-multi/auto_timers_construction.o gcc.compile.c bin.v2/libs/timer/build/gcc-4.6.2/release/address-model-32/threading-multi/cpu_timer.o common.mkdir bin.v2/libs/chrono common.mkdir bin.v2/libs/chrono/build common.mkdir bin.v2/libs/chrono/build/gcc-4.6.2 common.mkdir bin.v2/libs/chrono/build/gcc-4.6.2/release common.mkdir bin.v2/libs/chrono/build/gcc-4.6.2/release/address-model-32 common.mkdir bin.v2/libs/chrono/build/gcc-4.6.2/release/address-model-32/threading-multi gcc.compile.c bin.v2/libs/chrono/build/gcc-4.6.2/release/address-model-32/threading-multi/chrono.o gcc.compile.c bin.v2/libs/chrono/build/gcc-4.6.2/release/address-model-32/threading-multi/thread_clock.o gcc.compile.c bin.v2/libs/chrono/build/gcc-4.6.2/release/address-model-32/threading-multi/process_cpu_clocks.o In file included from ./boost/chrono/detail/inlined/process_cpu_clocks.hpp:39:0, from libs/chrono/src/process_cpu_clocks.cpp:17: ./boost/chrono/detail/inlined/posix/process_cpu_clocks.hpp: In static member function ‘static boost::chrono::process_system_cpu_clock::time_point boost::chrono::process_system_cpu_clock::now()’: ./boost/chrono/detail/inlined/posix/process_cpu_clocks.hpp:218:1: warning: control reaches end of non-void function [-Wreturn-type] common.mkdir bin.v2/libs/system/build/gcc-4.6.2/release/address-model-32 common.mkdir bin.v2/libs/system/build/gcc-4.6.2/release/address-model-32/threading-multi gcc.compile.c bin.v2/libs/system/build/gcc-4.6.2/release/address-model-32/threading-multi/error_code.o dll bin.v2/libs/system/build/gcc-4.6.2/release/address-model-32/threading-multi/libboost_1.48.0 dll bin.v2/libs/chrono/build/gcc-4.6.2/release/address-model-32/threading-multi/libboost_1.48.0 dll bin.v2/libs/timer/build/gcc-4.6.2/release/address-model-32/threading-multi/libboost_1.48.0 stage/lib/libboost_1.48.0 ln-UNIX stage/lib/libboost_common.mkdir bin.v2/libs/wave common.mkdir bin.v2/libs/wave/build common.mkdir bin.v2/libs/wave/build/gcc-4.6.2 common.mkdir bin.v2/libs/wave/build/gcc-4.6.2/release common.mkdir bin.v2/libs/wave/build/gcc-4.6.2/release/address-model-32 common.mkdir bin.v2/libs/wave/build/gcc-4.6.2/release/address-model-32/threading-multi gcc.compile.c bin.v2/libs/wave/build/gcc-4.6.2/release/address-model-32/threading-multi/instantiate_cpp_exprgrammar.o gcc.compile.c bin.v2/libs/wave/build/gcc-4.6.2/release/address-model-32/threading-multi/instantiate_cpp_grammar.o gcc.compile.c bin.v2/libs/wave/build/gcc-4.6.2/release/address-model-32/threading-multi/instantiate_cpp_literalgrs.o gcc.compile.c bin.v2/libs/wave/build/gcc-4.6.2/release/address-model-32/threading-multi/instantiate_defined_grammar.o gcc.compile.c bin.v2/libs/wave/build/gcc-4.6.2/release/address-model-32/threading-multi/instantiate_predef_macros.o gcc.compile.c bin.v2/libs/wave/build/gcc-4.6.2/release/address-model-32/threading-multi/instantiate_re2c_lexer.o gcc.compile.c bin.v2/libs/wave/build/gcc-4.6.2/release/address-model-32/threading-multi/instantiate_re2c_lexer_str.o gcc.compile.c bin.v2/libs/wave/build/gcc-4.6.2/release/address-model-32/threading-multi/token_ids.o gcc.compile.c bin.v2/libs/wave/build/gcc-4.6.2/release/address-model-32/threading-multi/wave_config_constant.o common.mkdir bin.v2/libs/wave/build/gcc-4.6.2/release/address-model-32/threading-multi/cpplexer common.mkdir bin.v2/libs/wave/build/gcc-4.6.2/release/address-model-32/threading-multi/cpplexer/re2clex gcc.compile.c bin.v2/libs/wave/build/gcc-4.6.2/release/address-model-32/threading-multi/cpplexer/re2clex/aq.o gcc.compile.c bin.v2/libs/wave/build/gcc-4.6.2/release/address-model-32/threading-multi/cpplexer/re2clex/cpp_re.o common.mkdir bin.v2/libs/date_time common.mkdir bin.v2/libs/date_time/build common.mkdir bin.v2/libs/date_time/build/gcc-4.6.2 common.mkdir bin.v2/libs/date_time/build/gcc-4.6.2/release common.mkdir bin.v2/libs/date_time/build/gcc-4.6.2/release/address-model-32 common.mkdir bin.v2/libs/date_time/build/gcc-4.6.2/release/address-model-32/threading-multi common.mkdir bin.v2/libs/date_time/build/gcc-4.6.2/release/address-model-32/threading-multi/gregorian gcc.compile.c bin.v2/libs/date_time/build/gcc-4.6.2/release/address-model-32/threading-multi/gregorian/greg_month.o gcc.compile.c bin.v2/libs/date_time/build/gcc-4.6.2/release/address-model-32/threading-multi/gregorian/greg_weekday.o gcc.compile.c bin.v2/libs/date_time/build/gcc-4.6.2/release/address-model-32/threading-multi/gregorian/date_generators.o dll bin.v2/libs/date_time/build/gcc-4.6.2/release/address-model-32/threading-multi/libboost_date_1.48.0 common.mkdir bin.v2/libs/filesystem/build/gcc-4.6.2/release/address-model-32 common.mkdir bin.v2/libs/filesystem/build/gcc-4.6.2/release/address-model-32/threading-multi common.mkdir bin.v2/libs/filesystem/build/gcc-4.6.2/release/address-model-32/threading-multi/v2 common.mkdir bin.v2/libs/filesystem/build/gcc-4.6.2/release/address-model-32/threading-multi/v2/src gcc.compile.c bin.v2/libs/filesystem/build/gcc-4.6.2/release/address-model-32/threading-multi/v2/src/v2_operations.o gcc.compile.c bin.v2/libs/filesystem/build/gcc-4.6.2/release/address-model-32/threading-multi/v2/src/v2_path.o gcc.compile.c bin.v2/libs/filesystem/build/gcc-4.6.2/release/address-model-32/threading-multi/v2/src/v2_portability.o common.mkdir bin.v2/libs/filesystem/build/gcc-4.6.2/release/address-model-32/threading-multi/v3 common.mkdir bin.v2/libs/filesystem/build/gcc-4.6.2/release/address-model-32/threading-multi/v3/src gcc.compile.c bin.v2/libs/filesystem/build/gcc-4.6.2/release/address-model-32/threading-multi/v3/src/operations.o gcc.compile.c bin.v2/libs/filesystem/build/gcc-4.6.2/release/address-model-32/threading-multi/v3/src/path.o gcc.compile.c bin.v2/libs/filesystem/build/gcc-4.6.2/release/address-model-32/threading-multi/v3/src/portability.o gcc.compile.c bin.v2/libs/filesystem/build/gcc-4.6.2/release/address-model-32/threading-multi/v3/src/windows_file_codecvt.o gcc.compile.c bin.v2/libs/filesystem/build/gcc-4.6.2/release/address-model-32/threading-multi/v3/src/codecvt_error_category.o gcc.compile.c bin.v2/libs/filesystem/build/gcc-4.6.2/release/address-model-32/threading-multi/v3/src/path_traits.o gcc.compile.c bin.v2/libs/filesystem/build/gcc-4.6.2/release/address-model-32/threading-multi/v3/src/unique_path.o gcc.compile.c bin.v2/libs/filesystem/build/gcc-4.6.2/release/address-model-32/threading-multi/v3/src/utf8_codecvt_facet.o dll bin.v2/libs/filesystem/build/gcc-4.6.2/release/address-model-32/threading-multi/libboost_1.48.0 dll bin.v2/libs/wave/build/gcc-4.6.2/release/address-model-32/threading-multi/libboost_1.48.0 stage/lib/libboost_1.48.0 ln-UNIX stage/lib/libboost_stage/lib/libboost_1.48.0 ln-UNIX stage/lib/libboost_stage/lib/libboost_1.48.0 ln-UNIX stage/lib/libboost_stage/lib/libboost_date_1.48.0 ln-UNIX stage/lib/libboost_date_common.mkdir bin.v2/libs/exception common.mkdir bin.v2/libs/exception/build common.mkdir bin.v2/libs/exception/build/gcc-4.6.2 common.mkdir bin.v2/libs/exception/build/gcc-4.6.2/release common.mkdir bin.v2/libs/exception/build/gcc-4.6.2/release/address-model-32 common.mkdir bin.v2/libs/exception/build/gcc-4.6.2/release/address-model-32/link-static common.mkdir bin.v2/libs/exception/build/gcc-4.6.2/release/address-model-32/link-static/threading-multi gcc.compile.c bin.v2/libs/exception/build/gcc-4.6.2/release/address-model-32/link-static/threading-multi/clone_current_exception_non_intrusive.o gcc.archive bin.v2/libs/exception/build/gcc-4.6.2/release/address-model-32/link-static/threading-multi/libboost_exception.a stage/lib/libboost_exception.a stage/lib/libboost_1.48.0 ln-UNIX stage/lib/libboost_common.mkdir bin.v2/libs/system/build/gcc-4.6.2/release/address-model-32/link-static common.mkdir bin.v2/libs/system/build/gcc-4.6.2/release/address-model-32/link-static/threading-multi gcc.compile.c bin.v2/libs/system/build/gcc-4.6.2/release/address-model-32/link-static/threading-multi/error_code.o gcc.archive bin.v2/libs/system/build/gcc-4.6.2/release/address-model-32/link-static/threading-multi/libboost_system.a stage/lib/libboost_system.a common.mkdir bin.v2/libs/chrono/build/gcc-4.6.2/release/address-model-32/link-static common.mkdir bin.v2/libs/chrono/build/gcc-4.6.2/release/address-model-32/link-static/threading-multi ..500th target...

READ THIS: https://github.com/mxcl/homebrew/wiki/troubleshooting These open issues may also help: https://github.com/mxcl/homebrew/issues/22805 * Use default darwin toolset. I tried re-downloading Boost, and using a different format (tar.bz2 instead of tar.bz), but it still does the same thing. Performing configuration checks - 32-bit : yes (cached) - arm : no (cached) - mips1 : no (cached) - power : no (cached) - sparc : no (cached) - x86 : yes (cached) error: No best alternative for libs/coroutine/build/allocator_sources next alternative: required properties: multi not matched - has_icu builds : yes (cached) warning: Graph library does not contain MPI-based parallel components. ...failed gcc.compile.c bin.v2/libs/iostreams/build/gcc-4.7/release/link-static/threading-multi/bzip2.o... (From here on, I got a lot of errors that look like these ones.) "g " -ftemplate-depth-128 -O3 -finline-functions -Wno-inline -Wall -pthread -DBOOST_ALL_NO_LIB=1 -DBOOST_PYTHON_SOURCE -DBOOST_PYTHON_STATIC_LIB -DNDEBUG -I"." -I"/usr/include/python2.7" -c -o "bin.v2/libs/python/build/gcc-4.7/release/link-static/threading-multi/object/function_doc_signature.o" "libs/python/src/object/function_doc_signature.cpp" ...failed gcc.compile.c bin.v2/libs/python/build/gcc-4.7/release/link-static/threading-multi/object/function_doc_signature.o...note: to enable them, add "using mpi ;" to your - zlib : yes (cached) - iconv (libc) : yes (cached) - icu : yes (cached) - compiler-supports-ssse3 : yes (cached) - compiler-supports-avx2 : yes (cached) - gcc visibility : yes (cached) - long double support : yes (cached) warning: skipping optional Message Passing Interface (MPI) library. note: to suppress this message, pass "--without-mpi" to bjam. I've been trying to compile Boost, but it's giving me errors. gcc.compile.c bin.v2/libs/iostreams/build/gcc-4.7/release/threading-multi/bzip2.o libs/iostreams/src/bzip2.cpp:: fatal error: bzlib.h: No such file or directory compilation terminated.Unfortunately, I can't use Debian's apt-get to get Boost, because I need version 1.5 or greater, and apt-get (for this version of Debian) only gets 1.49.0. I've already run ./b2 (no arguments) before, so that's where the found targets are coming from. A whole bunch of header files are reported missing. "g " -ftemplate-depth-128 -O3 -finline-functions -Wno-inline -Wall -pthread -f PIC -DBOOST_ALL_NO_LIB=1 -DBOOST_IOSTREAMS_DYN_LINK=1 -DBOOST_IOSTREAMS_USE_DEPRECATED -DNDEBUG -I"." -c -o "bin.v2/libs/iostreams/build/gcc-4.7/release/threading-multi/bzip2.o" "libs/iostreams/src/bzip2.cpp" ...failed gcc.compile.c bin.v2/libs/iostreams/build/gcc-4.7/release/threading-multi/bzip2.o... gcc.compile.c bin.v2/libs/python/build/gcc-4.7/release/threading-multi/numeric.o In file included from ./boost/python/detail/prefix.hpp:13:0, from ./boost/python/numeric.hpp:8, from libs/python/src/numeric.cpp:6: ./boost/python/detail/wrap_python.hpp:: fatal error: patchlevel.h: No such file or directory compilation terminated. gcc.compile.c bin.v2/libs/python/build/gcc-4.7/release/link-static/threading-multi/numeric.o In file included from ./boost/python/detail/prefix.hpp:13:0, from ./boost/python/numeric.hpp:8, from libs/python/src/numeric.cpp:6: ./boost/python/detail/wrap_python.hpp:: fatal error: patchlevel.h: No such file or directory compilation terminated.

boost failed updating 58 targets-34boost failed updating 58 targets-48boost failed updating 58 targets-50

- Used to set toolset as clang in C 11 build, which will override darwin settings and fail to increase template depth which is required for some of the libraries such as Boost.

One thought on “boost failed updating 58 targets”

  1. It is true, he might not always be up for every suggestion you have about doing new and spontaneous things that get him out of the everyday life, but that doesn’t mean you should stop suggesting.